{"text_format":"1","workbook":"xlsx","n_sheets":11,"sheets":["amaliati (2)","amaliati","setad","مقایسه تیر و مرداد","کارمزد سرپرست","بیمه","Print","Print (3)","Print (2)","Sheet1","Sheet2"],"not_rendered":{"charts":0,"images":4,"macros":1,"external_links":0,"defined_names":3,"comments":0,"pivot_tables":0},"unopened":[],"bounds":{"document_bytes":16777216,"sheet_cells":100000,"rows_first":2000,"rows_last":500,"rows_between":2000,"halvings":0,"cell_chars":16384,"cell_head_chars":4096},"cells_cut":0,"cells_raw":0,"read":"whole","date_system":"1900"}

{"sheet":"amaliati (2)","index":0,"n_rows":9,"n_cols":85,"rows_kept":9,"cut":false,"hidden":true,"merged":[[1,21,1,23],[0,3,0,25],[0,27,0,48],[0,50,0,73],[1,0,2,0],[1,1,2,1],[1,2,2,2],[1,3,2,3],[1,4,1,5],[1,6,2,6],[1,7,2,7],[1,8,2,8],[1,9,1,11],[1,12,2,12],[1,13,1,16],[1,17,1,20],[1,47,2,47],[1,24,2,24],[1,25,2,25],[1,27,1,28],[1,29,2,29],[1,30,2,30],[1,31,2,31],[1,32,1,34],[1,35,2,35],[1,36,1,39],[1,40,1,43],[1,44,1,46],[1,73,2,73],[1,48,2,48],[1,50,2,50],[1,51,1,52],[1,53,2,53],[1,56,2,56],[1,57,1,59],[1,60,2,60],[1,61,1,64],[1,65,1,68],[1,69,1,71],[1,72,2,72],[1,80,2,80],[1,81,2,81],[1,82,2,82],[1,83,2,83],[1,74,2,74],[1,75,2,75],[1,76,2,76],[1,77,2,77],[1,78,2,78],[1,79,2,79]]}
[null,null,null,"تعداد",null,null,null,null,null,null,null,null,null,null,null,null,null,null,null,null,null,null,null,null,null,null,null,"مبلغ",null,null,null,null,null,null,null,null,null,null,null,null,null,null,null,null,null,null,null,null,null,null,"محاسبه نهایی"]
["کد پرسنلی","کد ملی","شماره بیمه","نام","تعداد پایانه",null,"جمع کل دستگاه","درصد بازرسی","مونیتورینگ","پشتیبانی",null,null,"ورود به نمایندگی","نصب",null,null,null,"فسخ",null,null,null,"بازاریابی",null,null,"تعداد تراکنش","تعداد بازرسی بالای  95 ",null,"تعداد پایانه",null,"هزینه رفت و امد","درصد بازرسی","مونیتورینگ","پشتیبانی",null,null,"ورود به نمایندگی","نصب",null,null,null,"فسخ",null,null,null,"بازاریابی",null,null,"تعداد تراکنش","تعداد بازرسی بین 95 تا96",null,"نام","تعداد پایانه",null,"حقوق ثابت","هزینه رفت و ",null,"مونیتورینگ","پشتیبانی",null,null,"ورود به نمایندگی","نصب",null,null,null,"فسخ",null,null,null,"بازاریابی",null,null,"تعداد تراکنش","تعداد بازرسی بین 95 تا96","تشویق مدیریتی","حق اولاد","حقوق","حقوق ثابت پرسنل ستادی","مبلغ اضافه کاری","کسر حق بیمه سهم کارگر","کسر مالیات","کسر قسط","کسر مساعده","پرداخت نهایی"]
[null,null,null,null,"VIP","معمولی",null,null,null,"روز اول","روز دوم","روز سوم",null,"روز اول","روز دوم","روز سوم","روز چهارم","روز اول","روز دوم","روز سوم","روز چهارم","معمولی ","VIP","VVIP",null,null,null,"VIP","معمولی",null,null,null,"روز اول","روز دوم","روز سوم",null,"روز اول","روز دوم","روز سوم","روز چهارم","روز اول","روز دوم","روز سوم","روز چهارم","معمولی ","VIP","VVIP",null,null,null,null,"VIP","معمولی",null,"امد","درصد بازرسی",null,"روز اول","روز دوم","روز سوم",null,"روز اول","روز دوم","روز سوم","روز چهارم","روز اول","روز دوم","روز سوم","روز چهارم","معمولی ","VIP","VVIP"]
[null,null,null,"بهزاد اسکندری",126,693,{"$f":"SUM(E4:F4)","v":819},"0.9794",0,6,0,5,0,51,0,0,0,0,0,0,0,2,3,3,135855,0,null,18000,8500,3500,1,12000,25000,20000,-15000,20000,45000,35000,25000,-15000,25000,20000,15000,-15000,100000,300000,450000,20,100000,null,"بهزاد اسکندری",{"$f":"E4*AB4","v":2268000},5890500,{"$f":"SUM(AZ4:BA4)","v":8158500},{"$f":"AD4*SUM(E4:F4)","v":2866500},{"$f":"H4","v":"0.9794"},{"$f":"I4*AF4","v":0},150000,0,-75000,0,{"$f":"AK4*N4","v":2295000},0,0,0,{"$f":"R4*AO4","v":0},0,{"$f":"AQ4*T4","v":0},0,{"$f":"V4*AS4","v":200000},900000,1350000,2717100,0,700000,null,{"$f":"SUM(BB4:BC4)*BD4+SUM(BE4:BG4)-BH4+SUM(BI4:BL4)-BM4+SUM(BN4:BP4)-BQ4+SUM(BR4:BX4)","v":19184985},0,0,777650,{"$f":"(BY4-20000000)*10%","v":-81501.5},null,null,{"$f":"BY4-SUM(CB4:CE4)","v":18488836.5},"حق بیمه سهم کارگر واریز شد"]
[null,null,null,"اکبر آهنگر",138,605,{"$f":"SUM(E5:F5)","v":743},0.98760000000000003,0,11,0,10,0,38,0,0,0,0,0,0,0,2,1,0,161647,0,null,18000,8500,3000,1,12000,25000,20000,-15000,20000,45000,35000,25000,-15000,25000,20000,15000,-15000,100000,300000,450000,20,100000,null,"اکبر آهنگر",2484000,5142500,{"$f":"SUM(AZ5:BA5)","v":7626500},2229000,{"$f":"H5","v":0.98760000000000003},0,275000,0,-150000,0,1710000,0,0,0,0,0,0,0,200000,300000,0,3232940,0,2570069,929931,{"$f":"SUM(BB5:BC5)*BD5+SUM(BE5:BG5)-BH5+SUM(BI5:BL5)-BM5+SUM(BN5:BP5)-BQ5+SUM(BR5:BX5)","v":19101231.800000001},0,0,777650,0,3000000,null,{"$f":"BY5-SUM(CB5:CE5)","v":15323581.800000001}]
[null,null,null,"فرشاد پاشایی",145,604,749,"0.9510",0,6,0,15,0,60,0,0,0,15,0,0,0,1,2,2,213062,0,null,18000,8500,3000,1,12000,25000,20000,-15000,20000,45000,35000,25000,-15000,25000,20000,15000,-15000,100000,300000,450000,20,100000,null,"فرشاد پاشایی",2610000,5134000,7744000,2247000,"0.9510",0,150000,0,-225000,0,2700000,0,0,0,375000,0,0,0,100000,600000,900000,4261240,0,null,null,{"$f":"SUM(BB6:BC6)*BD6+SUM(BE6:BG6)-BH6+SUM(BI6:BL6)-BM6+SUM(BN6:BP6)-BQ6+SUM(BR6:BX6)","v":18812681},0,0,777650,0,null,null,18035031]
[null,null,null,"علیرضا چکوری",157,541,698,"0.9517",0,11,2,19,1,27,0,0,0,0,0,0,0,2,3,1,168694,0,null,18000,8500,3500,1,12000,25000,20000,-15000,20000,45000,35000,25000,-15000,25000,20000,15000,-15000,100000,300000,450000,20,100000,null,"علیرضا چکوری",2826000,4598500,7424500,2443000,"0.9517",0,275000,40000,-285000,20000,1215000,0,0,0,0,0,0,0,200000,900000,450000,3373880,0,null,929931,17079710.75,0,0,777650,0,null,null,16302060.75]
[null,null,null,"حسین قاسمی",115,746,861,"0.9347",0,5,0,0,8,23,0,0,0,17,0,0,0,0,0,1,170230,0,null,18000,8500,3000,1,12000,25000,20000,-15000,20000,45000,35000,25000,-15000,25000,20000,15000,-15000,100000,300000,450000,20,100000,null,"حسین قاسمی",2070000,6341000,8411000,2583000,"0.9347",0,125000,0,0,160000,1035000,0,0,0,425000,0,0,0,0,0,450000,3404600,0,null,null,15875691.799999999,0,0,777650,0,2000000,null,13098041.799999999]
{"$rows_left_out":2}
{"sheet":"amaliati","index":1,"n_rows":79,"n_cols":90,"rows_kept":79,"cut":false,"hidden":false,"merged":[[1,8,2,8],[1,21,1,23],[1,6,2,6],[1,89,2,89],[1,84,2,84],[1,85,2,85],[1,86,2,86],[1,87,2,87],[1,88,2,88],[1,12,2,12],[1,24,2,24],[1,9,1,11],[1,13,1,16],[1,17,1,20],[1,81,2,81],[1,82,2,82],[0,50,0,73],[1,50,2,50],[1,51,1,52],[1,56,2,56],[1,57,1,59],[1,65,1,68],[1,53,2,53],[1,61,1,64],[1,69,1,71],[1,72,2,72],[1,73,2,73],[1,40,1,43],[1,44,1,46],[1,60,2,60],[1,77,2,77],[1,78,2,78],[1,47,2,47],[1,48,2,48],[1,79,2,79],[1,80,2,80],[1,76,2,76],[1,74,2,74],[1,75,2,75],[0,0,0,25],[1,0,2,0],[1,27,1,28],[1,4,1,5],[1,35,2,35],[1,7,2,7],[1,29,2,29],[1,31,2,31],[0,27,0,48],[1,25,2,25],[1,30,2,30],[1,36,1,39],[1,32,1,34],[1,1,2,1],[1,2,2,2],[1,3,2,3]]}
["تعداد",null,null,null,null,null,null,null,null,null,null,null,null,null,null,null,null,null,null,null,null,null,null,null,null,null,null,"مبلغ",null,null,null,null,null,null,null,null,null,null,null,null,null,null,null,null,null,null,null,null,null,null,"محاسبه نهایی"]
["نام","کد ملی","کد پرسنلی","شماره بیمه","تعداد پایانه",null,"جمع کل دستگاه","درصد بازرسی","درصد بازرسی","پشتیبانی",null,null,"ورود به نمایندگی","نصب",null,null,null,"فسخ",null,null,null,"بازاریابی",null,null,"تعداد تراکنش","تعداد بازرسی بالای  95 ",null,"تعداد پایانه",null,"هزینه رفت و امد","درصد بازرسی","مونیتورینگ","پشتیبانی",null,null,"ورود به نمایندگی","نصب",null,null,null,"فسخ",null,null,null,"بازاریابی",null,null,"تعداد تراکنش","تعداد بازرسی بین 95 تا96",null,"نام","تعداد پایانه",null,"حقوق ثابت","هزینه رفت و ",null,"مونیتورینگ","پشتیبانی",null,null,"ورود به نمایندگی","نصب",null,null,null,"فسخ",null,null,null,"بازاریابی",null,null,"تعداد تراکنش","تعداد بازرسی بین 95 تا96","تشویق مدیریتی","حق اولاد","حقوق","کسر حق بیمه سهم کارگر","کسر مالیات","کسر قسط","کسر مساعده","پرداخت نهایی","مانده از فیش قبل",null,"مرخصی ساعتی (دقیقه)","روزکارکرد","مرخصی روزانه","مرخصی بدون حقوق","تعداد مانیتورنیگ","مانده از فیش قبل"]
[null,null,null,null,"VIP","معمولی",null,null,null,"روز اول","روز دوم","روز سوم",null,"روز اول","روز دوم","روز سوم","روز چهارم","روز اول","روز دوم","روز سوم","روز چهارم","معمولی ","VIP","VVIP",null,null,null,"VIP","معمولی",null,null,null,"روز اول","روز دوم","روز سوم",null,"روز اول","روز دوم","روز سوم","روز چهارم","روز اول","روز دوم","روز سوم","روز چهارم","معمولی ","VIP","VVIP",null,null,null,null,"VIP","معمولی",null,"امد","درصد بازرسی",null,"روز اول","روز دوم","روز سوم",null,"روز اول","روز دوم","روز سوم","روز چهارم","روز اول","روز دوم","روز سوم","روز چهارم","معمولی ","VIP","VVIP"]
["بهزاد اسکندری",123,78,57,129,686,{"$f":"SUM(E4:F4)","v":815},0.96799999999999997,{"$f":"IF(H4>=0.95,1,H4)","v":1},11,8,6,0,28,0,0,0,18,0,0,0,3,2,0,126491,{"$f":"(H4*G4)-(G4*95/100)","v":14.669999999999959},null,18000,11500,6200,1,12000,25000,20000,-15000,20000,45000,35000,25000,-15000,25000,20000,15000,-15000,100000,300000,450000,20,100000,null,"بهزاد اسکندری",{"$f":"E4*AB4","v":2322000},{"$f":"F4*AC4","v":7889000},{"$f":"SUM(AZ4:BA4)*I4","v":10211000},{"$f":"AD4*SUM(E4:F4)","v":5053000},{"$f":"I4","v":1},{"$f":"CK4*AF4","v":12000},{"$f":"J4*AG4","v":275000},{"$f":"K4*AH4","v":160000},{"$f":"L4*AI4","v":-90000},{"$f":"M4*AJ4","v":0},{"$f":"AK4*N4","v":1260000},{"$f":"AL4*O4","v":0},{"$f":"AM4*P4","v":0},{"$f":"AN4*Q4","v":0},{"$f":"R4*AO4","v":450000},{"$f":"S4*AP4","v":0},{"$f":"AQ4*T4","v":0},{"$f":"AR4*U4","v":0},{"$f":"V4*AS4","v":300000},{"$f":"W4*AT4","v":600000},{"$f":"X4*AU4","v":0},{"$f":"Y4*AV4","v":2529820},{"$f":"Z4*AW4","v":1466999.9999999958},0,0,{"$f":"((BB4+BC4)*BD4)+BE4+BF4+BG4+BH4+BI4+BJ4+BK4+BL4+BM4+BN4+BO4+BP4+BQ4+BR4+BS4+BT4+BU4+BV4+BW4+BX4","v":22227819.999999996},777650,{"$f":"IF((BY4-BX4)>=20000000,(BY4-20000000)*10%,0)","v":222781.99999999965},null,null,{"$f":"BY4-BZ4-CA4-CB4-CC4","v":21227387.999999996},null,"حق بیمه سهم کارگر واریز شد",1,2,3,4,1]
["اکبر آهنگر",null,null,null,129,607,{"$f":"SUM(E5:F5)","v":736},0.95379999999999998,{"$f":"IF(H5>=0.95,1,H5)","v":1},24,2,8,0,25,0,0,0,17,0,0,0,2,0,2,159778,{"$f":"(H5*G5)-(G5*95/100)","v":2.796799999999962},null,18000,11500,6800,1,12000,25000,20000,-15000,20000,45000,35000,25000,-15000,25000,20000,15000,-15000,100000,300000,450000,20,100000,null,"اکبر آهنگر",2322000,6980500,{"$f":"SUM(AZ5:BA5)*I5","v":9302500},5004800,{"$f":"I5","v":1},{"$f":"CK5*AF5","v":0},600000,40000,-120000,0,1125000,0,0,0,425000,0,0,0,200000,0,900000,3195560,279679.99999999622,null,null,{"$f":"((BB5+BC5)*BD5)+BE5+BF5+BG5+BH5+BI5+BJ5+BK5+BL5+BM5+BN5+BO5+BP5+BQ5+BR5+BS5+BT5+BU5+BV5+BW5+BX5","v":20952539.999999996},777650,{"$f":"IF((BY5-BX5)>=20000000,(BY5-20000000)*10%,0)","v":95253.999999999636},3000000,null,{"$f":"BY5-BZ5-CA5-CB5-CC5","v":17079635.999999996}]
["فرشاد پاشایی",null,null,null,148,589,737,0.96340000000000003,1,16,4,9,2,41,0,0,0,22,0,0,0,5,3,3,202361,9.8758000000000266,null,18000,11500,7500,1,12000,25000,20000,-15000,20000,45000,35000,25000,-15000,25000,20000,15000,-15000,100000,300000,450000,20,100000,null,"فرشاد پاشایی",2664000,6773500,9437500,5527500,1,0,400000,80000,-135000,40000,1845000,0,0,0,550000,0,0,0,500000,900000,1350000,4047220,987580.00000000268,null,null,25529800.000000004,777650,552980.00000000035,null,null,24199170.000000004]
["علیرضا چکوری",null,null,null,156,542,698,0.6321,0.6321,0,0,0,0,0,0,0,0,0,0,0,0,1,0,0,165054,0,null,18000,11500,1500,1,12000,25000,20000,-15000,20000,45000,35000,25000,-15000,25000,20000,15000,-15000,100000,300000,450000,20,100000,null,"علیرضا چکوری",2808000,6233000,5714816.0999999996,1047000,0.6321,0,0,0,0,0,0,0,0,0,0,0,0,0,100000,0,0,3301080,0,null,null,7675223.9568099994,777650,0,null,null,6897573.9568099994]
["حسین قاسمی",null,null,null,101,747,848,0.88500000000000001,0.88500000000000001,41,0,7,2,29,0,0,0,17,0,0,0,0,0,0,152075,0,null,18000,11500,4200,1,12000,25000,20000,-15000,20000,45000,35000,25000,-15000,25000,20000,15000,-15000,100000,300000,450000,20,100000,null,"حسین قاسمی",1818000,8590500,9211522.5,3561600,0.88500000000000001,0,1025000,0,-105000,40000,1305000,0,0,0,425000,0,0,0,0,0,0,3041500,0,null,null,17035713.412500001,777650,0,2000000,null,14258063.412500001,null,null,null,null,1]
{"$rows_left_out":72}
{"sheet":"setad","index":2,"n_rows":16,"n_cols":26,"rows_kept":16,"cut":false,"hidden":true,"merged":[[2,25,3,25],[2,23,3,23],[2,10,3,10],[2,11,3,11],[2,17,3,17],[2,18,3,18],[2,19,3,19],[2,20,3,20],[2,21,3,21],[2,22,3,22],[2,16,3,16],[0,1,0,25],[2,0,3,0],[2,1,3,1],[2,2,3,2],[2,3,3,3],[2,4,3,4],[2,5,3,5],[2,6,3,6],[2,7,3,7],[2,8,3,8],[2,9,3,9],[2,12,3,12],[2,13,3,13],[2,14,3,14],[2,15,3,15],[2,24,3,24]]}
[null,"محاسبات قانونی"]
[]
["نام","ساعت کارکرد","اضافه کار","کسر کار","مرخصی ساعتی","روز کارکرد","مرخصی استحقاقی","مرخصی استعلاجی","مرخصی بدون حقوق","حقوق پایه قانونی 31 روز","مبلغ توافقی ماهانه","مبلغ ساعتی","مبلغ اضافه کاری","حق مسکن","بن کارگری","حق اولاد","حق ماموریت","کمک هزینه پوشاک","ایاب و ذهاب","جمع حقوق و مزایا مشمول مالیات","جمع حقوق و مزایا مشمول بیمه","بیمه سهم کارگر","مساعده","اقسات","مالیات","خالص قابل پرداخت"]
[]
["محمد جواد مرعشی",0,0,null,null,31,null,null,0,9609287,30000000,0,0,400000,1100000,null,null,null,null,null,null,777650,null,null,0]
["پدیدار",0,0,null,null,31,null,null,0,9609287,50000000,0,0,400000,1100000,null,null,null,null,null,null,777650,null,null,0]
["سحر خاکسار",222,{"$f":"B7-192","v":30},null,null,31,null,null,0,9609287,18000000,{"$f":"K7/192","v":93750},{"$f":"L7*C7","v":2812500},400000,1100000,null,null,null,null,null,null,777650,null,null,0]
["سعید صحرایی",343,151,null,null,31,null,null,0,9609287,14000000,0,{"$f":"L8*C8","v":0},400000,1100000,929931,null,null,null,null,null,777650,null,null,0]
{"$rows_left_out":9}
{"sheet":"مقایسه تیر و مرداد","index":3,"n_rows":27,"n_cols":14,"rows_kept":27,"cut":false,"hidden":true,"merged":[[0,0,0,2],[0,4,0,6],[0,8,0,10]]}
["تیر",null,null,null,"مرداد",null,null,null,"مرداد ویرایش 2"]
["نام","مبلغ خالص پرداخت ","مبلغ ناخالص",null,"نام","مبلغ خالص پرداخت ","مبلغ ناخالص",null,"نام","مبلغ خالص پرداخت ","مبلغ ناخالص"]
["بهزاداسکندری",17559082,18707480,null,"بهزاداسکندری",17497878.630000003,18083920.700000003,null,"بهزاداسکندری",{"$f":"amaliati!CD4","v":21227387.999999996},{"$f":"amaliati!BY4","v":22227819.999999996},null,{"$f":"K3-C3","v":3520339.9999999963},700000]
["اکبرآهنگر",12475868,18615020,null,"اکبرآهنگر",11823581.800000001,15601231.800000001,null,"اکبرآهنگر",{"$f":"amaliati!CD5","v":17079635.999999996},{"$f":"amaliati!BY5","v":20952539.999999996},null,{"$f":"K4-C4","v":2337519.9999999963},3500000]
["فرشادپاشایی",10898190,16675840,null,"فرشادپاشایی",18035031,18812681,null,"فرشادپاشایی",{"$f":"amaliati!CD6","v":24199170.000000004},{"$f":"amaliati!BY6","v":25529800.000000004},null,8853960.0000000037]
["پدیدار",50000000,53333333,null,"پدیدار",50000000,50000000,null,"پدیدار",50000000,50000000]
[" علیرضا چکوری",13060250,15837900,null," علیرضا چکوری",15039986.449999999,15817636.449999999,null," علیرضا چکوری",{"$f":"amaliati!CD7","v":6897573.9568099994},{"$f":"amaliati!BY7","v":7675223.9568099994},null,-8162676.0431900006]
["حسین قاسمی",8287797.5999999996,12065447.6,null,"حسین قاسمی",13098041.799999999,15875691.799999999,null,"حسین قاسمی",{"$f":"amaliati!CD8","v":14258063.412500001},{"$f":"amaliati!BY8","v":17035713.412500001},null,4970265.8125000019]
{"$rows_left_out":20}
{"sheet":"کارمزد سرپرست","index":4,"n_rows":32,"n_cols":10,"rows_kept":32,"cut":false,"hidden":true,"merged":[[30,17,30,23],[19,5,19,6],[31,17,31,23],[1,16,1,26],[2,20,2,21],[12,17,12,23],[13,17,13,23],[18,16,18,26],[19,20,19,21],[31,2,31,9],[1,1,1,11],[2,5,2,6],[18,1,18,11],[12,2,12,9],[30,2,30,9],[13,2,13,9]]}
[]
[null,"کارمزد فصل چهارم بازرسی دفتر تهران"]
[null,null,"تراکنش",null,null,"فسخ",null,"نصب","بازاریابی","ورود به نمایندگی"]
[null,"امید یل",216096,null,null,null,17,21,450000,2]
[null,"پیمان قبادی",240240,null,null,null,29,35,0,0]
[null,"حسین قاسمی",170230,null,null,null,17,23,450000,8]
[null,"علیرضا ناجی",228275,null,null,null,15,37,2650000,0]
[null,"فرشاد پاشایی",213062,null,null,null,15,60,1600000,0]
{"$rows_left_out":25}
{"sheet":"بیمه","index":5,"n_rows":23,"n_cols":12,"rows_kept":23,"cut":false,"hidden":true,"merged":[]}
["ردیف","نام و نام خانوادگی","روز کارکرد","هزينه بيمه اي  سهم شركت","حق بيمه اي  سهم پرسنل","جمع کل 30% بیمه",null,null,"دستمزد روزانه ","دستمزد ماهانه","مزایای ماهانه مشمول","مزایای ماهانه  غیر مشمول"]
[1,"اکبر آهنگر",31,2555136.0100000002,777650,{"$f":"SUM(D2:E2)","v":3332786.0100000002},null,null,309977,{"$f":"I2*31","v":9609287},{"$f":"SUM(400000+1100000)","v":1500000},929931]
[2,"فرشاد پاشایی",31,2555136.0100000002,777650,3332786.0100000002,null,null,309977,{"$f":"I3*31","v":9609287},{"$f":"SUM(400000+1100000)","v":1500000}]
[3,"علیرضا چکوری",31,2555136.0100000002,777650,3332786.0100000002,null,null,309977,9609287,1500000,929931]
[4,"حسین قاسمی",31,2555136.0100000002,777650,3332786.0100000002,null,null,309977,9609287,1500000]
[5,"حامد میرشاه مرادی",31,2555136.0100000002,777650,3332786.0100000002,null,null,309977,9609287,1500000]
[6,"پوریا شهرآشوب",31,2555136.0100000002,777650,3332786.0100000002,null,null,309977,9609287,{"$f":"SUM(400000+1100000)","v":1500000}]
[7,"بهمن طهماسبی",31,2555136.0100000002,777650,3332786.0100000002,null,null,309977,9609287,1500000,929931]
{"$rows_left_out":16}
{"sheet":"Print","index":6,"n_rows":38,"n_cols":18,"rows_kept":38,"cut":false,"hidden":false,"merged":[[15,12,15,14],[19,12,19,13],[13,3,13,5],[14,3,14,5],[13,6,13,7],[14,6,14,7],[13,12,13,13],[14,12,14,13],[13,11,14,11],[18,3,18,5],[15,11,16,11],[15,9,15,10],[16,9,16,10],[15,3,15,8],[16,3,16,8],[17,3,17,5],[12,9,12,10],[13,8,13,10],[14,8,14,10],[9,3,9,7],[8,12,8,14],[8,3,8,11],[10,3,10,7],[11,3,11,8],[11,9,11,10],[9,11,10,11],[9,12,9,13],[11,11,12,11],[10,12,10,13],[11,12,11,13],[12,12,12,13],[12,3,12,8],[2,9,2,10],[2,11,2,12],[6,3,6,17],[7,9,7,10],[7,7,7,8],[7,3,7,5],[25,15,25,17],[25,11,26,11],[14,15,14,16],[20,15,20,16],[15,15,15,16],[16,15,16,16],[17,15,17,16],[18,15,18,16],[22,13,22,17],[19,15,19,16],[21,11,22,11],[21,15,21,16],[16,12,16,13],[17,12,17,13],[18,12,18,13],[17,11,18,11],[8,15,8,17],[10,15,10,16],[11,15,11,16],[12,15,12,16],[13,15,13,16],[9,15,9,16],[42,6,42,11],[23,13,23,14],[23,15,23,17],[24,13,24,14],[24,15,24,17],[25,13,25,14],[38,6,38,11],[39,6,39,11],[29,3,32,11],[23,8,23,9],[24,8,24,9],[23,3,23,4],[24,3,24,4],[25,7,25,10],[26,15,26,17],[27,13,27,14],[20,7,20,10],[20,3,20,6],[26,13,26,14],[40,6,40,11],[41,6,41,11],[28,13,28,14],[19,11,20,11],[26,7,26,10],[25,3,25,6],[26,3,26,6],[27,11,28,11],[19,7,19,10],[19,3,19,6],[23,11,24,11],[35,3,35,17],[37,3,37,17],[34,3,34,17],[36,3,36,12],[36,16,36,17],[36,13,36,15],[27,15,27,17],[28,15,28,17]]}
[]
[]
[null,null,null,null,null,null,null,null,null,"بهزاد اسکندری",null,"انتخاب شخص:"]
[]
[]
[]
[null,null,null,"شرکت پردازش افق درفک "]
[null,null,null,null,null,null,"ماه: 4","سال مالی: 1396",null,{"$f":"VLOOKUP($J$3,amaliati!$A$4:$CF$200,COLUMN(B4),0)","v":123},null,"کد ملی:",{"$f":"VLOOKUP($J$3,amaliati!$A$4:$CF$200,COLUMN(C4),0)","v":78},"کد پرسنلی:",{"$f":"VLOOKUP($J$3,amaliati!$A$4:$CF$200,COLUMN(D4),0)","v":57},"شماره بیمه:",{"$f":"J3","v":"بهزاد اسکندری"},"نام و نام خانوادگی:"]
{"$rows_left_out":31}
{"sheet":"Print (3)","index":7,"n_rows":38,"n_cols":18,"rows_kept":38,"cut":false,"hidden":true,"merged":[[2,9,2,10],[2,11,2,12],[6,3,6,17],[7,3,7,5],[7,7,7,8],[7,9,7,10],[8,3,8,11],[8,12,8,14],[8,15,8,17],[9,3,9,7],[9,11,10,11],[9,12,9,13],[9,15,9,16],[10,3,10,7],[10,12,10,13],[10,15,10,16],[11,3,11,8],[11,9,11,10],[11,11,12,11],[11,12,11,13],[11,15,11,16],[12,3,12,8],[12,9,12,10],[12,12,12,13],[12,15,12,16],[13,15,13,16],[14,3,14,5],[14,6,14,7],[14,8,14,9],[14,12,14,13],[13,3,13,5],[13,6,13,7],[13,8,13,9],[13,11,14,11],[13,12,13,13],[14,15,14,16],[15,3,15,8],[15,9,15,10],[15,11,16,11],[15,15,15,16],[16,3,16,8],[16,9,16,10],[16,15,16,16],[19,3,19,6],[19,7,19,10],[19,11,20,11],[19,15,19,16],[20,3,20,6],[20,7,20,10],[20,15,20,16],[17,3,17,5],[17,11,18,11],[17,15,17,16],[18,3,18,5],[18,15,18,16],[21,11,22,11],[21,15,21,16],[22,13,22,17],[24,3,24,4],[24,8,24,9],[24,13,24,14],[24,15,24,17],[23,3,23,4],[23,8,23,9],[23,11,24,11],[23,13,23,14],[23,15,23,17],[25,3,25,6],[25,7,25,10],[25,11,26,11],[25,13,25,14],[25,15,25,17],[26,3,26,6],[26,7,26,10],[26,13,26,14],[26,15,26,17],[27,11,28,11],[27,13,27,14],[27,15,27,17],[28,13,28,14],[28,15,28,17],[39,6,39,11],[40,6,40,11],[41,6,41,11],[42,6,42,11],[29,3,32,11],[34,3,34,17],[35,3,35,17],[36,3,36,17],[37,3,37,17],[38,6,38,11]]}
[]
[]
[null,null,null,null,null,null,null,null,null,"اکبر آهنگر",null,"انتخاب شخص:"]
[]
[]
[]
[null,null,null,"شرکت پردازش افق درفک "]
[null,null,null,null,null,null,"ماه: 4","سال مالی: 1396",null,{"$f":"VLOOKUP($J$3,amaliati!$A$4:$CF$200,COLUMN(B4),0)","v":0},null,"کد ملی:",{"$f":"VLOOKUP($J$3,amaliati!$A$4:$CF$200,COLUMN(C4),0)","v":0},"کد پرسنلی:",{"$f":"VLOOKUP($J$3,amaliati!$A$4:$CF$200,COLUMN(D4),0)","v":0},"شماره بیمه:",{"$f":"J3","v":"اکبر آهنگر"},"نام و نام خانوادگی:"]
{"$rows_left_out":31}
{"sheet":"Print (2)","index":8,"n_rows":43,"n_cols":18,"rows_kept":43,"cut":false,"hidden":true,"merged":[[42,6,42,11],[42,13,42,14],[42,15,42,17],[8,12,8,14],[40,6,40,11],[40,13,40,14],[40,15,40,17],[41,6,41,11],[41,13,41,14],[41,15,41,17],[38,6,38,11],[38,13,38,14],[38,15,38,17],[39,6,39,11],[39,13,39,14],[39,15,39,17],[32,13,32,14],[32,15,33,17],[33,12,42,12],[33,13,33,14],[34,6,34,11],[34,13,34,14],[34,15,34,17],[35,6,35,11],[35,13,35,14],[35,15,35,17],[36,6,36,11],[36,13,36,14],[36,15,36,17],[37,6,37,11],[37,13,37,14],[37,15,37,17],[30,6,30,7],[30,8,30,9],[30,10,30,11],[30,13,30,14],[30,16,30,17],[31,6,31,7],[31,8,31,9],[31,10,31,11],[31,13,31,14],[31,16,31,17],[28,6,28,7],[28,10,28,11],[28,13,28,14],[28,16,28,17],[29,6,29,7],[29,10,29,11],[29,13,29,14],[29,16,29,17],[26,13,26,14],[26,16,26,17],[27,6,27,7],[27,10,27,11],[27,13,27,14],[27,16,27,17],[26,6,26,7],[26,10,26,11],[23,6,23,7],[23,10,23,11],[24,6,24,7],[24,10,24,11],[25,10,25,11],[21,15,21,16],[11,6,11,7],[11,10,11,11],[12,6,12,7],[13,6,13,7],[14,10,14,11],[17,6,17,7],[17,10,17,11],[18,6,18,7],[18,11,19,11],[18,14,19,14],[19,6,19,7],[20,10,20,11],[8,15,8,17],[9,6,9,7],[9,13,9,14],[9,16,9,17],[10,6,10,7],[8,6,8,11],[2,9,2,10],[2,11,2,12],[6,11,6,12],[7,6,7,7],[7,8,7,9]]}
[]
[]
[null,null,null,null,null,null,null,null,null,"اکبر آهنگر",null,"انتخاب شخص:"]
[]
[]
[]
[null,null,null,null,null,null,null,null,null,null,null,"شرکت پردازش افق درفک "]
[null,null,null,null,null,null,"ماه: 4",null,"سال مالی: 1396",null,"659-9854443","کد ملی:",102,"کد پرسنلی:",null,"شماره بیمه:",{"$f":"J3","v":"اکبر آهنگر"},"نام و نام خانوادگی:"]
{"$rows_left_out":36}
{"sheet":"Sheet1","index":9,"n_rows":16,"n_cols":26,"rows_kept":16,"cut":false,"hidden":false,"merged":[[0,1,0,25],[2,0,3,0],[2,1,3,1],[2,2,3,2],[2,3,3,3],[2,4,3,4],[2,5,3,5],[2,6,3,6],[2,7,3,7],[2,8,3,8],[2,20,3,20],[2,9,3,9],[2,10,3,10],[2,11,3,11],[2,12,3,12],[2,13,3,13],[2,14,3,14],[2,15,3,15],[2,16,3,16],[2,17,3,17],[2,18,3,18],[2,25,3,25],[2,19,3,19],[2,21,3,21],[2,22,3,22],[2,23,3,23],[2,24,3,24]]}
[null,"محاسبات قانونی"]
[]
["نام","ساعت کارکرد","اضافه کار","کسر کار","مرخصی ساعتی","روز کارکرد","مرخصی استحقاقی","مرخصی استعلاجی","مرخصی بدون حقوق","حقوق پایه قانونی 31 روز","مبلغ توافقی ماهانه","مبلغ ساعتی","مبلغ اضافه کاری","حق مسکن","بن کارگری","حق اولاد","حق ماموریت","کمک هزینه پوشاک","ایاب و ذهاب","جمع حقوق و مزایا مشمول مالیات","جمع حقوق و مزایا مشمول بیمه","بیمه سهم کارگر","مساعده","اقسات","مالیات","خالص قابل پرداخت"]
[]
["پدیدار",0,0,null,null,31,null,null,0,9609287,50000000,0,0,0,0,null,null,null,null,null,null,0,0,0,0,{"$f":"SUM(K5:U5)-SUM(V5:Y5)","v":50000000}]
["سحر خاکسار",225,{"$f":"B6-192","v":33},null,null,31,null,null,0,9609287,18000000,{"$f":"K6/192","v":93750},{"$f":"L6*C6","v":3093750},null,null,null,null,null,null,null,null,777650,null,null,0,{"$f":"SUM(K6:U6)-SUM(V6:Y6)","v":20409850}]
["سعید صحرایی",253,61,null,null,31,3,null,0,9609287,14000000,0,11429112,null,null,929931,null,null,null,null,null,777650,8500000,3000000,0,14081393]
["مهتاش فداکار",150,0,null,null,31,5,null,0,9609287,21000000,{"$f":"K8/192","v":109375},{"$f":"L8*C8","v":0},null,null,null,null,null,null,null,null,777650,null,null,0,20331725]
{"$rows_left_out":9}
{"sheet":"Sheet2","index":10,"n_rows":30,"n_cols":10,"rows_kept":30,"cut":false,"hidden":false,"merged":[[28,2,28,9],[29,2,29,9],[1,1,1,11],[2,5,2,6],[10,2,10,9],[11,2,11,9],[16,1,16,11],[17,5,17,6]]}
[]
[null,"کارمزد فصل چهارم بازرسی دفتر تهران"]
[null,null,"تراکنش",null,null,"فسخ",null,"نصب","بازاریابی","ورود به نمایندگی"]
[null,"پیمان قبادی",228458,null,null,null,15,46,{"$f":"SUM(amaliati!BT13)","v":900000},2]
[null,"حسین قاسمی",152075,null,null,null,17,29,0,2]
[null,"علیرضا ناجی",228555,null,null,null,0,35,{"$f":"SUM(amaliati!BS16)","v":900000}]
[null,"فرشاد پاشایی",202361,null,null,null,22,41,{"$f":"SUM(amaliati!BR6:BT6)","v":2750000},2]
[null,"مهران غریبی",246153,null,null,null,20,44,{"$f":"SUM(amaliati!BR12:BT12)","v":1650000}]
{"$rows_left_out":22}